سنگ آذرین
type: Concept
preferred label: igneous rock @en
related: سنگ‌های کلسیمی- قلیایی

ماگمای کلسیمی- قلیایی
type: Concept
preferred label: calc-alkaline magma @en
related: سنگ‌های کلسیمی- قلیایی

سنگ‌های کلسیمی- قلیایی
type: Concept
preferred label: calc-alkaline rocks @en
related: ماگمای کلسیمی- قلیایی
related: سنگ آذرین
scope note: سنگ‌های آذرینی که مقدار کلسیم موجود در آنها از عناصر قلیایی بیشتر است و شاخص قلیایی آهکی آنها بین 56 تا 61 است