تراکی‌بازالت
type: Concept
preferred label: trachybasalt @en
related: بنموریت

سنگ آتشفشانی
type: Concept
narrower: بنموریت
preferred label: volcanic rock @en

بنموریت
type: Concept
broader: سنگ آتشفشانی
preferred label: benmoreite @en
related: تراکی‌بازالت
scope note: سنگ آذرین اشباع شده یا تحت اشباع از سیلیس، با ترکیب حدواسط ما بین موژآریت و تراکیت