رشته‌کوه سانتا کاتالینا
type: Concept
preferred label: santa catalina mountains @en
related: ناحیه پیما آریزونا
scope note: رشته کوچکی در شمال شرق ناحیه پیما در جنوب آریزونا

ناحیه پیما آریزونا
type: Concept
preferred label: pima county arizona @en
related: رشته‌کوه سانتا کاتالینا