دریاچه ویلسون
type: Concept
preferred label: wilson lake @en
related: ناحیه جروم ایداهو
scope note: مخزنی در ناحیه جرومه، جنوب ایداهو. ضمناً در محلهای دیگر واقع شده است

ناحیه جروم ایداهو
type: Concept
preferred label: jerome county idaho @en
related: دریاچه ویلسون