توموتین
type: Concept
broader: کامبرین زیرین
preferred label: tommotian @en
scope note: اتحاد جماهیر شوروی سوسیالیستی. کامبرین زیرین

کامبرین زیرین
type: Concept
narrower: توموتین
preferred label: lower cambrian @en