بلورهای خاویاری
type: Concept
broader: بلور
preferred label: oolitic crystals @en
scope note: انبوهۀ کانیایی که از کره‌های ریزی شبیه به تخم ماهی تشکیل شده است

بلور
type: Concept
narrower: بلورهای خاویاری
preferred label: crystal @en