جزیره مارگاریت
type: Concept
broader: جزایر ونزوئلایی
preferred label: margarita island @en
scope note: در دریای کارائیب 15 مایلی ساحل جنوب شرقی.

جزایر ونزوئلایی
type: Concept
narrower: جزیره مارگاریت
preferred label: venezuelan islands @en