گویلین
type: Concept
broader: گوانگزی چین
preferred label: guilin @en
scope note: ناحیه کارست احاطه‌کننده شهری در شمال شرق گوانگزی چین.

گوانگزی چین
type: Concept
narrower: گویلین
preferred label: guangxi china @en