آتشفشان
type: Concept
preferred label: volcano @en
related: باندایی

باندایی
type: Concept
alternative label: باندایی-سان
broader: فوکوشیمای ژاپن
preferred label: bandai @en
related: آتشفشان
scope note: از 1998 به آتشفشانی در فوکوشیما، مرکز هونشو ژاپن محدود گردید

فوکوشیمای ژاپن
type: Concept
narrower: باندایی
preferred label: fukushima japan @en