حوضه رود سوسیتنا
type: Concept
preferred label: susitna river basin @en
related: رودخانه سوسیتنا

رودخانه سوسیتنا
type: Concept
broader: آلاسکای جنوبی
preferred label: susitna river @en
related: حوضه رود سوسیتنا
scope note: جنوب مرکز آلاسکا، از کوه‌هایس در رشته‌کوه آلاسکا به فروافتادگی کوک نزدیک آنکوریج جریان دارد.

آلاسکای جنوبی
type: Concept
narrower: رودخانه سوسیتنا
preferred label: southern alaska @en