رودخانه فیدر
type: Concept
preferred label: feather river @en
related: گنبد اورُوویل

گنبد اورُوویل
type: Concept
broader: ناحیه باتلر کالیفرنیا
preferred label: oroville dam @en
related: رودخانه فیدر
scope note: سد خاکی سنگریزه‌ای بر رود فیتر که مخزن اورویل در ناحیه بوت شمال مرکز کالیفرنیا را تشکیل میدهد

ناحیه باتلر کالیفرنیا
type: Concept
narrower: گنبد اورُوویل
preferred label: butte county california @en