جومیلا اسپانیا
type: Concept
broader: مورسیا اسپانیا
preferred label: jumilla spain @en

مورسیا اسپانیا
type: Concept
broader: منطقه مورسیا
narrower: جومیلا اسپانیا
preferred label: murcia spain @en
scope note: بیانگر جامعه خودمختار و ایالت همزاد آن است که در جنوب شرق اسپانیا واقع شده است.

منطقه مورسیا
type: Concept
narrower: مورسیا اسپانیا
preferred label: murcia region @en