ناحیه پیما آریزونا
preferred label: pima county arizona @en
type: Concept
related: رشته‌کوه سانتا کاتالینا

رشته‌کوه سانتا کاتالینا
scope note: رشته کوچکی در شمال شرق ناحیه پیما در جنوب آریزونا
related: ناحیه پیما آریزونا
preferred label: santa catalina mountains @en
type: Concept