توموتین
scope note: اتحاد جماهیر شوروی سوسیالیستی. کامبرین زیرین
broader: کامبرین زیرین
preferred label: tommotian @en
type: Concept

کامبرین زیرین
preferred label: lower cambrian @en
type: Concept
narrower: توموتین