بافت
preferred label: texture @en
type: Concept
narrower: بافت دانه‌شکفتی

بافت دانه‌شکفتی
scope note: نوعی بافت هم‌شکفت در سنگ‌های دگرگونی غیرشیستی که براثر بازبلورش هم‌بُعد شده‌اند
related: سنگ دگرگونی
broader: بافت
preferred label: granoblastic texture @en
type: Concept

سنگ دگرگونی
preferred label: metamorphic rock @en
type: Concept
related: بافت دانه‌شکفتی