کلمبیا
preferred label: colombia @en
type: Concept
narrower: دلتای ماگدالنا

دلتای ماگدالنا
scope note: در دهانه رود ماگدالنا در دریای کارائیب نزدیک بارانکوئیلا.
broader: کلمبیا
preferred label: magdalena delta @en
type: Concept