میندانائو
scope note: دومین جزیره بزرگ و جنوبی ترین جزیره بزرگ جزایر فیلیپن.
broader: جزایر فیلیپین
preferred label: mindanao @en
type: Concept

جزایر فیلیپین
preferred label: philippine islands @en
type: Concept
narrower: میندانائو