اسمولنسک فدراسیون روسیه
scope note: استانی شامل شهری در کناره چپ رود دنیپر بالایی جنوب غرب مسکو
broader: فدراسیون روسیه
preferred label: smolensk russian federation @en
type: Concept

فدراسیون روسیه
preferred label: russian federation @en
type: Concept
narrower: اسمولنسک فدراسیون روسیه