رودخانه سوسیتنا
scope note: جنوب مرکز آلاسکا، از کوه‌هایس در رشته‌کوه آلاسکا به فروافتادگی کوک نزدیک آنکوریج جریان دارد.
related: حوضه رود سوسیتنا
broader: آلاسکای جنوبی
preferred label: susitna river @en
type: Concept

حوضه رود سوسیتنا
preferred label: susitna river basin @en
type: Concept
related: رودخانه سوسیتنا

آلاسکای جنوبی
preferred label: southern alaska @en
type: Concept
narrower: رودخانه سوسیتنا