نیومکزیکو
preferred label: new mexico @en
type: Concept
narrower: ماگدالنا نیومکزیکو

ماگدالنا نیومکزیکو
scope note: نام یک روستا و مرکز معدن‌کاری در غرب مرکز نیومکزیکو.
broader: نیومکزیکو
preferred label: mgdalena new mexico @en
type: Concept