پشته ناینتی ایست
scope note: پشته زیردریایی که در جهت شمال و جنوب خط 90 درجه طول شرقی از جنوب جزایر نیکوبار تا حدود 30 درجه عرض جنوبی امتداد دارد.
broader: اقیانوس هند
preferred label: ninetyeast ridge @en
type: Concept

اقیانوس هند
preferred label: indian ocean @en
type: Concept
narrower: پشته ناینتی ایست