لیگوریا ایتالیا
preferred label: liguria italy @en
type: Concept
narrower: جنوا ایتالیا

جنوا ایتالیا
scope note: ایالت و نام شهری در کناره دریای لیگورین در شمال غرب ایتالیا.
broader: لیگوریا ایتالیا
preferred label: genoa italy @en
type: Concept