مونتی بریشی
scope note: رشته ای از تپه های آتشفشانی جنوب غرب ویچنزا در شمال شرق ایتالیا.
broader: ونتو ایتالیا
preferred label: monti berici @en
type: Concept

ونتو ایتالیا
preferred label: veneto italy @en
type: Concept
narrower: مونتی بریشی