لیسبون پرتغال
scope note: پایتخت و شهر بندری، ناحیه لیسوبا. جنوب غرب ساحل پرتغال.
broader: پرتغال
preferred label: lisbon portugal @en
type: Concept

پرتغال
preferred label: portugal @en
type: Concept
narrower: لیسبون پرتغال