بلژیک
preferred label: belgium @en
type: Concept
narrower: آنتورپ بلژیک

آنتورپ بلژیک
scope note: ایالتی در شمال بلژیک شامل شهری در دهانه رود شلدت غربی
broader: بلژیک
preferred label: antwerp belgium @en
type: Concept