اتریش
preferred label: austria @en
type: Concept
narrower: لینرزباخ اتریش

لینرزباخ اتریش
scope note: روستایی در جنوب شرق اینسبروک در مرکز تیرول، غرب اتریش.
broader: اتریش
preferred label: lanersbach austria @en
type: Concept