سنگ‌های کلسیمی- قلیایی
scope note: سنگ‌های آذرینی که مقدار کلسیم موجود در آنها از عناصر قلیایی بیشتر است و شاخص قلیایی آهکی آنها بین 56 تا 61 است
related: ماگمای کلسیمی- قلیایی
related: سنگ آذرین
preferred label: calc-alkaline rocks @en
type: Concept

سنگ آذرین
preferred label: igneous rock @en
type: Concept
related: سنگ‌های کلسیمی- قلیایی

ماگمای کلسیمی- قلیایی
preferred label: calc-alkaline magma @en
type: Concept
related: سنگ‌های کلسیمی- قلیایی