خلیج نیوپورت
scope note: بندرگاه لایروبی شده در ناحیه اورنگ (اورنج) جنوب کالیفرنیا. ممکن است در جاهای دیگری نیز واقع شده باشد.
related: ناحیه اورنج کالیفرنیا
preferred label: newport bay @en
type: Concept

ناحیه اورنج کالیفرنیا
preferred label: orange county california @en
type: Concept
related: خلیج نیوپورت