ناوپایان
scope note: رده کوچکی از نرم‌تنان دریایی که برای نقب زدن و سوراخ کردن ویژگی یافته‌اند صدف آنها که شبیه عاج است لوله‌ای بوده و دو انتهایش باز است
narrower: دنتالیم
broader: نرم تنان
preferred label: scaphopoda @en
type: Concept

نرم تنان
preferred label: mollusca @en
type: Concept
narrower: ناوپایان

دنتالیم
preferred label: dentalium @en
type: Concept
broader: ناوپایان