بلور
preferred label: crystal @en
type: Concept
narrower: بلورهای خاویاری

بلورهای خاویاری
scope note: انبوهۀ کانیایی که از کره‌های ریزی شبیه به تخم ماهی تشکیل شده است
broader: بلور
preferred label: oolitic crystals @en
type: Concept