بیگانه‌ریخت
preferred label: xenomorphic @en
type: Concept
related: بافت دانه‌ای بیگانه‌ریخت

بافت دانه‌ای بیگانه‌ریخت
scope note: بافت آذرین ویدایی که بخش اعظم آن از دانه‌های هم‌‌اندازۀ بی‌وجه تشکیل شده است
related: بیگانه‌ریخت
broader: بافت دانه‌ای
preferred label: xenomorphic-granular texture @en
type: Concept

بافت دانه‌ای
preferred label: granular texture @en
type: Concept
narrower: بافت دانه‌ای بیگانه‌ریخت