زانزی بار
scope note: جزیره ای در اقیانوس هند کناره شمال غربی ساحل تانزانیا.
related: جزایر اقیانوس هند
broader: تانزانیا
preferred label: zanzibar @en
type: Concept

جزایر اقیانوس هند
preferred label: indian ocean islands @en
type: Concept
related: زانزی بار

تانزانیا
preferred label: tanzania @en
type: Concept
narrower: زانزی بار