آفریقای غربی
preferred label: west africa @en
type: Concept
narrower: سیرالئون

سیرالئون
scope note: مستعمره قدیمی بریتانیا و تحت الحمایه آن. در سال 1961 مستقل شد
broader: آفریقای غربی
preferred label: sierra leone @en
type: Concept