جزیره پانای
preferred label: panay island @en
type: Concept
related: جزایر ایلویلو فیلیپین

جزایر ایلویلو فیلیپین
scope note: ایالت، جنوب شرق جزیره پانای و جزیره گویماراس، جزایر فیلیپین. همچنین نام شهری.
related: جزیره پانای
broader: جزایر فیلیپین
preferred label: iloilo philippine islands @en
type: Concept

جزایر فیلیپین
preferred label: philippine islands @en
type: Concept
narrower: جزایر ایلویلو فیلیپین