گویلین
scope note: ناحیه کارست احاطه‌کننده شهری در شمال شرق گوانگزی چین.
broader: گوانگزی چین
preferred label: guilin @en
type: Concept

گوانگزی چین
preferred label: guangxi china @en
type: Concept
narrower: گویلین