هونشو
preferred label: honshu @en
type: Concept
narrower: کمربند ریوک

کمربند ریوک
scope note: کمربند دگرگونی ناحیه میدوی مابین یوکوهوما و ناگویا
broader: هونشو
preferred label: ryoke belt @en
type: Concept