کولار هند
scope note: شهر و ناحیه‌ای در شرق کاماتاکا، جنوب غرب هند.
broader: کارناتاکا هندوستان
preferred label: kolar india @en
type: Concept

کارناتاکا هندوستان
preferred label: karnataka india @en
type: Concept
narrower: کولار هند