پروکوپیوسک فدراسیون روسیه
scope note: شهری در جنوب انتهای حوزه کوزنتسک در استان خودمختار کمرووُ در جنوب سیبری
broader: فدراسیون روسیه
preferred label: prokopyevsk russian federation @en
type: Concept

فدراسیون روسیه
preferred label: russian federation @en
type: Concept
narrower: پروکوپیوسک فدراسیون روسیه