ناحیه لاورنس ایلینویز
scope note: توسط رود واباش در جنوب شرق ایلینویز محدود شده است.
broader: ایلینویز
preferred label: lawrence county illinois @en
type: Concept

ایلینویز
preferred label: illinois @en
type: Concept
narrower: ناحیه لاورنس ایلینویز