ناحیه نیوپورت جزیره رود
scope note: کناره اقیانوس اطلس در جنوب شرق جزیره رود.
broader: جزیره رُود
preferred label: newport county rhode island @en
type: Concept

جزیره رُود
preferred label: rhode island @en
type: Concept
narrower: ناحیه نیوپورت جزیره رود