میشیگان
preferred label: michigan @en
type: Concept
narrower: ناحیه هاوتون میشیگان

ناحیه هاوتون میشیگان
scope note: شمال غرب شبه جزیره میشیگان‌علیا. شمال غرب میشیگان.
broader: میشیگان
preferred label: houghton county michigan @en
type: Concept