نیویورک
preferred label: new york @en
type: Concept
narrower: دره موهاوک

دره موهاوک
scope note: دره رودخانه‌ای در شرق مرکز نیویورک. برای بخشی از انشعاب میانی رود فیدر در شمال شرق کالیفرنیا نیز استفاده می شود.
related: فلات آپالاچین
broader: نیویورک
preferred label: mohawk valley @en
type: Concept

فلات آپالاچین
preferred label: appalachian plateau @en
type: Concept
related: دره موهاوک