فلات واساچ
scope note: فلات بلندی در جنوب انتهای رشته‌کوه واساچ در مرکز یوتا
broader: یوتا
preferred label: wasatch plateau @en
type: Concept

یوتا
preferred label: utah @en
type: Concept
narrower: فلات واساچ