اقیانوس هند
preferred label: indian ocean @en
type: Concept
narrower: فلات نچرالیست

فلات نچرالیست
scope note: جنوب شرق اقیانوس آرام کناره جنوب غربی استرالیا.
broader: اقیانوس هند
preferred label: naturaliste plateau @en
type: Concept