آندلس اسپانیا
preferred label: andalusia spain @en
type: Concept
narrower: سویل اسپانیا

سویل اسپانیا
scope note: تنها بیانگر ایالتی در جنوب غرب اسپانیاست
broader: آندلس اسپانیا
preferred label: seville spain @en
type: Concept