منطقه مورسیا
preferred label: murcia region @en
type: Concept
narrower: مورسیا اسپانیا

جومیلا اسپانیا
preferred label: jumilla spain @en
type: Concept
broader: مورسیا اسپانیا

مورسیا اسپانیا
scope note: بیانگر جامعه خودمختار و ایالت همزاد آن است که در جنوب شرق اسپانیا واقع شده است.
narrower: جومیلا اسپانیا
broader: منطقه مورسیا
preferred label: murcia spain @en
type: Concept