وین اتریش
scope note: شهر مستقل در کناره رود دانوب در شرق اتریش سفلی؛ شمال شرق اتریش
broader: لاور اتریش
preferred label: vienna austria @en
type: Concept

لاور اتریش
preferred label: lower austria @en
type: Concept
narrower: وین اتریش